Reaction Details
TargetDelta-type opioid receptor
LigandBDBM50130604
Substrate/Competitorn/a
Meas. Tech.ChEMBL_145475 (CHEMBL751262)
Ki 103±n/a nM
Citation Grundt, PMartinez-Bermejo, FLewis, JWHusbands, SM Opioid binding and in vitro profiles of a series of 4-hdroxy-3-methoxyindolomorphinans. Transformation of a delta-selective ligand into a high affinity kappa-selective ligand by introduction of a 5,14-substituted bridge. J Med Chem46:3174-7 (2003) 
 
Delta-type opioid receptor
Name:Delta-type opioid receptor
Type:G Protein-Coupled Receptor (GPCR)
Mol. Mass.:40382.98
Organism:Homo sapiens (Human)
Description:Competition binding assays were carried out using membrane preparations from transfected HN9.10 cells that constitutively expressed the delta opioid receptor.
Residue:372
BDBM50130604
NameBDBM50130604
Synonyms:19-methoxy-24-methyl-26-(1-methylethylidene)-4,24-diazaheptacyclo[12.7.3.22,13.01,13.03,11.05,10.016,21]hexacosa-3(11),5(10),6,8,16(21),17,19-heptaen-20-ol | CHEMBL107207
TypeSmall organic molecule
Emp. Form.C29H32N2O2
Mol. Mass.440.5766
SMILESCOc1ccc2CC3N(C)CC[C@@]4([C@@H]5C(C[C@]34Cc3c5[nH]c4ccccc34)=C(C)C)c2c1O