Reaction Details
TargetKappa-type opioid receptor
LigandBDBM21864
Substrate/Competitorn/a
Meas. Tech.ChEMBL_147234 (CHEMBL754922)
EC50 5±n/a nM
Citation Grundt, PMartinez-Bermejo, FLewis, JWHusbands, SM Opioid binding and in vitro profiles of a series of 4-hdroxy-3-methoxyindolomorphinans. Transformation of a delta-selective ligand into a high affinity kappa-selective ligand by introduction of a 5,14-substituted bridge. J Med Chem46:3174-7 (2003) 
 
Kappa-type opioid receptor
Name:Kappa-type opioid receptor
Type:G Protein-Coupled Receptor (GPCR)
Mol. Mass.:42648.76
Organism:Homo sapiens (Human)
Description:P41145
Residue:380
BDBM21864
NameBDBM21864
Synonyms:(21R)-22-(cyclopropylmethyl)-14-oxa-11,22-diazaheptacyclo[13.9.1.0^{1,13}.0^{2,21}.0^{4,12}.0^{5,10}.0^{19,25}]pentacosa-4(12),5,7,9,15,17,19(25)-heptaene-2,16-diol NALTRINDOLE | [3H]-naltrindole
Typeradiolabeled ligand
Emp. Form.C26H26N2O3
Mol. Mass.414.4962
SMILES[H][C@@]12Cc3ccc(O)c4OC5c6[nH]c7ccccc7c6CC1(O)C5(CCN2CC1CC1)c34