Reaction Details
TargetNeprilysin
LigandBDBM50130716
Substrate/Competitorn/a
Meas. Tech.ChEMBL_144317 (CHEMBL754362)
IC50 20000±n/a nM
Citation Filimonov, DAGomazkov, OALagunin, AAGureeva, TADilakyan, EAKugaevskaya, EVElisseeva, YESolovyeva, NIPoroikov, VV Computer-aided selection of potential antihypertensive compounds with dual mechanism of action. J Med Chem46:3326-32 (2003) 
 
Neprilysin
Name:Neprilysin
Type:Enzyme
Mol. Mass.:85505.38
Organism:Homo sapiens (Human)
Description:P08473
Residue:750
BDBM50130716
NameBDBM50130716
Synonyms:CHEMBL322069 | Thioacetic acid S-(2-phenylcarbamoyl-propyl) ester
TypeSmall organic molecule
Emp. Form.C12H15NO2S
Mol. Mass.237.318
SMILESCC(CSC(C)=O)C(=O)Nc1ccccc1