Reaction Details
TargetMajor prion protein
LigandBDBM50131720
Substrate/Competitorn/a
Meas. Tech.ChEMBL_158887 (CHEMBL760875)
EC50>10000±n/a nM
Citation Vogtherr, MGrimme, SElshorst, BJacobs, DMFiebig, KGriesinger, CZahn, R Antimalarial drug quinacrine binds to C-terminal helix of cellular prion protein. J Med Chem46:3563-4 (2003) 
 
Major prion protein
Name:Major prion protein
Type:PROTEIN
Mol. Mass.:27671.97
Organism:Homo sapiens (Human)
Description:ChEMBL_158887
Residue:253
BDBM50131720
NameBDBM50131720
Synonyms:9,10-diazaanthracene acridizine dibenzo-p-diazine dibenzopyrazine | phenazine
TypeSmall organic molecule
Emp. Form.C12H8N2
Mol. Mass.180.2053
SMILESc1ccc2nc3ccccc3nc2c1