Reaction Details
TargetThymidylate kinase
LigandBDBM1
Substrate/Competitorn/a
Meas. Tech.ChEMBL_208211 (CHEMBL873990)
Ki 27000±n/a nM
Citation Vanheusden, VMunier-Lehmann, HFroeyen, MDugué, LHeyerick, ADe Keukeleire, DPochet, SBusson, RHerdewijn, PVan Calenbergh, S 3'-C-branched-chain-substituted nucleosides and nucleotides as potent inhibitors of Mycobacterium tuberculosis thymidine monophosphate kinase. J Med Chem46:3811-21 (2003) 
 
Thymidylate kinase
Name:Thymidylate kinase
Type:PROTEIN
Mol. Mass.:22636.29
Organism:Mycobacterium tuberculosis
Description:ChEMBL_208218
Residue:214
BDBM1
NameBDBM1
Synonyms:dT | thymidine
TypeNucleoside or nucleotide
Emp. Form.C10H14N2O5
Mol. Mass.242.2286
SMILESCc1cn([C@H]2C[C@H](O)[C@@H](CO)O2)c(=O)[nH]c1=O