Reaction Details
TargetThymidylate kinase
LigandBDBM50131910
Substrate/Competitorn/a
Meas. Tech.ChEMBL_208211 (CHEMBL873990)
Ki 29000±n/a nM
Citation Vanheusden, VMunier-Lehmann, HFroeyen, MDugué, LHeyerick, ADe Keukeleire, DPochet, SBusson, RHerdewijn, PVan Calenbergh, S 3'-C-branched-chain-substituted nucleosides and nucleotides as potent inhibitors of Mycobacterium tuberculosis thymidine monophosphate kinase. J Med Chem46:3811-21 (2003) 
 
Thymidylate kinase
Name:Thymidylate kinase
Type:PROTEIN
Mol. Mass.:22636.29
Organism:Mycobacterium tuberculosis
Description:ChEMBL_208218
Residue:214
BDBM50131910
NameBDBM50131910
Synonyms:Phosphoric acid mono-[3-hydroxymethyl-5-(5-methyl-2,4-dioxo-3,4-dihydro-2H-pyrimidin-1-yl)-tetrahydro-furan-2-ylmethyl] ester
TypeSmall organic molecule
Emp. Form.C11H15N2O8P
Mol. Mass.334.2203
SMILESCc1cn([C@H]2C[C@H](CO)[C@@H](COP([O-])([O-])=O)O2)c(=O)[nH]c1=O