Reaction Details
TargetThymidine kinase, cytosolic
LigandBDBM50131915
Substrate/Competitorn/a
Meas. Tech.ChEMBL_208213 (CHEMBL815478)
Ki 970000±n/a nM
Citation Vanheusden, VMunier-Lehmann, HFroeyen, MDugué, LHeyerick, ADe Keukeleire, DPochet, SBusson, RHerdewijn, PVan Calenbergh, S 3'-C-branched-chain-substituted nucleosides and nucleotides as potent inhibitors of Mycobacterium tuberculosis thymidine monophosphate kinase. J Med Chem46:3811-21 (2003) 
 
Thymidine kinase, cytosolic
Name:Thymidine kinase, cytosolic
Type:PROTEIN
Mol. Mass.:25476.50
Organism:Homo sapiens (Human)
Description:ChEMBL_1333884
Residue:234
BDBM50131915
NameBDBM50131915
Synonyms:1-(4-Fluoromethyl-5-hydroxymethyl-tetrahydro-furan-2-yl)-5-methyl-1H-pyrimidine-2,4-dione | CHEMBL127523
TypeSmall organic molecule
Emp. Form.C11H15FN2O4
Mol. Mass.258.2462
SMILESCc1cn([C@H]2C[C@H](CF)[C@@H](CO)O2)c(=O)[nH]c1=O