Reaction Details
TargetHydroxycarboxylic acid receptor 2
LigandBDBM50132135
Substrate/Competitorn/a
Meas. Tech.ChEMBL_144336 (CHEMBL751847)
Ki>100000±n/a nM
Citation van Herk, TBrussee, Jvan den Nieuwendijk, AMvan der Klein, PAIJzerman, APStannek, CBurmeister, ALorenzen, A Pyrazole derivatives as partial agonists for the nicotinic acid receptor. J Med Chem46:3945-51 (2003) 
 
Hydroxycarboxylic acid receptor 2
Name:Hydroxycarboxylic acid receptor 2
Type:PROTEIN
Mol. Mass.:41476.06
Organism:Rattus norvegicus
Description:ChEMBL_820675
Residue:360
BDBM50132135
NameBDBM50132135
Synonyms:4,6-Dihydro-1H-furo[3,4-c]pyrazole-3-carboxylic acid CHEMBL338071
TypeSmall organic molecule
Emp. Form.C6H6N2O3
Mol. Mass.154.1234
SMILESOC(=O)c1[nH]nc2COCc12