Reaction Details
TargetHydroxycarboxylic acid receptor 2
LigandBDBM50132136
Substrate/Competitorn/a
Meas. Tech.ChEMBL_144336 (CHEMBL751847)
Ki 21400±n/a nM
Citation van Herk, TBrussee, Jvan den Nieuwendijk, AMvan der Klein, PAIJzerman, APStannek, CBurmeister, ALorenzen, A Pyrazole derivatives as partial agonists for the nicotinic acid receptor. J Med Chem46:3945-51 (2003) 
 
Hydroxycarboxylic acid receptor 2
Name:Hydroxycarboxylic acid receptor 2
Type:PROTEIN
Mol. Mass.:41476.06
Organism:Rattus norvegicus
Description:ChEMBL_820675
Residue:360
BDBM50132136
NameBDBM50132136
Synonyms:5-Undecyl-1H-pyrazole-3-carboxylic acid | CHEMBL128077
TypeSmall organic molecule
Emp. Form.C15H26N2O2
Mol. Mass.266.3791
SMILESCCCCCCCCCCCc1cc(n[nH]1)C(O)=O