Reaction Details
TargetHydroxycarboxylic acid receptor 2
LigandBDBM50132139
Substrate/Competitorn/a
Meas. Tech.ChEMBL_144336 (CHEMBL751847)
Ki 6300±n/a nM
Citation van Herk, TBrussee, Jvan den Nieuwendijk, AMvan der Klein, PAIJzerman, APStannek, CBurmeister, ALorenzen, A Pyrazole derivatives as partial agonists for the nicotinic acid receptor. J Med Chem46:3945-51 (2003) 
 
Hydroxycarboxylic acid receptor 2
Name:Hydroxycarboxylic acid receptor 2
Type:PROTEIN
Mol. Mass.:41476.06
Organism:Rattus norvegicus
Description:ChEMBL_820675
Residue:360
BDBM50132139
NameBDBM50132139
Synonyms:5-(3-Phenyl-propyl)-1H-pyrazole-3-carboxylic acid | CHEMBL129326
TypeSmall organic molecule
Emp. Form.C13H14N2O2
Mol. Mass.230.2625
SMILESOC(=O)c1cc(CCCc2ccccc2)[nH]n1