Reaction Details
Target5-hydroxytryptamine receptor 2A
LigandBDBM50133229
Substrate/Competitorn/a
Meas. Tech.ChEMBL_2672 (CHEMBL617920)
Ki 0.3±n/a nM
Citation May, JAChen, HHRusinko, ALynch, VMSharif, NAMcLaughlin, MA A novel and selective 5-HT2 receptor agonist with ocular hypotensive activity: (S)-(+)-1-(2-aminopropyl)-8,9-dihydropyrano[3,2-e]indole. J Med Chem46:4188-95 (2003) 
 
5-hydroxytryptamine receptor 2A
Name:5-hydroxytryptamine receptor 2A
Type:G Protein-Coupled Receptor (GPCR)
Mol. Mass.:52852.05
Organism:Rattus norvegicus (rat)
Description:Rat cortex membranes 5-HT2A receptors.
Residue:471
BDBM50133229
NameBDBM50133229
Synonyms:1-Methyl-2-(3,7,8,9-tetrahydro-pyrano[3,2-e]indol-1-yl)-ethylamine | CHEMBL133868
TypeSmall organic molecule
Emp. Form.C14H18N2O
Mol. Mass.230.3055
SMILESCC(N)Cc1c[nH]c2ccc3OCCCc3c12