Reaction Details
Target5-hydroxytryptamine receptor 1A
LigandBDBM50014219
Substrate/Competitorn/a
Meas. Tech.ChEMBL_2258 (CHEMBL617484)
Ki 4.6±n/a nM
Citation May, JAChen, HHRusinko, ALynch, VMSharif, NAMcLaughlin, MA A novel and selective 5-HT2 receptor agonist with ocular hypotensive activity: (S)-(+)-1-(2-aminopropyl)-8,9-dihydropyrano[3,2-e]indole. J Med Chem46:4188-95 (2003) 
 
5-hydroxytryptamine receptor 1A
Name:5-hydroxytryptamine receptor 1A
Type:n/a
Mol. Mass.:46122.49
Organism:Homo sapiens (Human)
Description:n/a
Residue:422
BDBM50014219
NameBDBM50014219
Synonyms:2-(5-Methoxy-1H-indol-3-yl)-1-methyl-ethylamine CHEMBL31115
TypeSmall organic molecule
Emp. Form.C12H16N2O
Mol. Mass.204.2682
SMILESCOc1ccc2[nH]cc(CC(C)N)c2c1