Reaction Details
TargetC-C chemokine receptor type 5
LigandBDBM50134056
Substrate/Competitorn/a
Meas. Tech.ChEMBL_39639 (CHEMBL649945)
Ki 3±n/a nM
Citation Debnath, AK Generation of predictive pharmacophore models for CCR5 antagonists: study with piperidine- and piperazine-based compounds as a new class of HIV-1 entry inhibitors. J Med Chem46:4501-15 (2003) 
 
C-C chemokine receptor type 5
Name:C-C chemokine receptor type 5
Type:Enzyme
Mol. Mass.:40540.21
Organism:Homo sapiens (Human)
Description:P51681
Residue:352
BDBM50134056
NameBDBM50134056
Synonyms:(4-{(4-Bromo-phenyl)-[(E)-ethoxyimino]-methyl}-4'-methyl-[1,4']bipiperidinyl-1'-yl)-(2-fluoro-6-trifluoromethyl-phenyl)-methanone | CHEMBL423000
TypeSmall organic molecule
Emp. Form.C28H32BrF4N3O2
Mol. Mass.598.47
SMILESCCO\N=C(/C1CCN(CC1)C1(C)CCN(CC1)C(=O)c1c(F)cccc1C(F)(F)F)c1ccc(Br)cc1