Reaction Details
TargetC-C chemokine receptor type 5
LigandBDBM50104957
Substrate/Competitorn/a
Meas. Tech.ChEMBL_39639 (CHEMBL649945)
Ki 20±n/a nM
Citation Debnath, AK Generation of predictive pharmacophore models for CCR5 antagonists: study with piperidine- and piperazine-based compounds as a new class of HIV-1 entry inhibitors. J Med Chem46:4501-15 (2003) 
 
C-C chemokine receptor type 5
Name:C-C chemokine receptor type 5
Type:Enzyme
Mol. Mass.:40540.21
Organism:Homo sapiens (Human)
Description:P51681
Residue:352
BDBM50104957
NameBDBM50104957
Synonyms:(2,6-Dimethyl-phenyl)-(4-{(S)-4-[(S)-1-(4-iodo-phenyl)-ethyl]-3-methyl-piperazin-1-yl}-piperidin-1-yl)-methanone CHEMBL112659
TypeSmall organic molecule
Emp. Form.C27H36IN3O
Mol. Mass.545.4987
SMILESC[C@H](N1CCN(C[C@@H]1C)C1CCN(CC1)C(=O)c1c(C)cccc1C)c1ccc(I)cc1