Reaction Details
TargetC-C chemokine receptor type 5
LigandBDBM50115530
Substrate/Competitorn/a
Meas. Tech.ChEMBL_39639 (CHEMBL649945)
Ki 78±n/a nM
Citation Debnath, AK Generation of predictive pharmacophore models for CCR5 antagonists: study with piperidine- and piperazine-based compounds as a new class of HIV-1 entry inhibitors. J Med Chem46:4501-15 (2003) 
 
C-C chemokine receptor type 5
Name:C-C chemokine receptor type 5
Type:Enzyme
Mol. Mass.:40540.21
Organism:Homo sapiens (Human)
Description:P51681
Residue:352
BDBM50115530
NameBDBM50115530
Synonyms:CHEMBL106468 {4-[(4-Bromo-phenyl)-hydroxyimino-methyl]-4'-methyl-[1,4']bipiperidinyl-1'-yl}-(2,6-dimethyl-phenyl)-methanone
TypeSmall organic molecule
Emp. Form.C27H34BrN3O2
Mol. Mass.512.482
SMILESCc1cccc(C)c1C(=O)N1CCC(C)(CC1)N1CCC(CC1)C(N=O)c1ccc(Br)cc1