Reaction Details
TargetC-C chemokine receptor type 5
LigandBDBM50104943
Substrate/Competitorn/a
Meas. Tech.ChEMBL_39639 (CHEMBL649945)
Ki 58±n/a nM
Citation Debnath, AK Generation of predictive pharmacophore models for CCR5 antagonists: study with piperidine- and piperazine-based compounds as a new class of HIV-1 entry inhibitors. J Med Chem46:4501-15 (2003) 
 
C-C chemokine receptor type 5
Name:C-C chemokine receptor type 5
Type:Enzyme
Mol. Mass.:40540.21
Organism:Homo sapiens (Human)
Description:P51681
Residue:352
BDBM50104943
NameBDBM50104943
Synonyms:4-[(4-Bromophenyl)methyl]-1'-(2,6-dimethylbenzoyl)-4'-methyl-1,4'-bipiperidine [4-(4-Bromo-benzyl)-4'-methyl-[1,4']bipiperidinyl-1'-yl]-(2,6-dimethyl-phenyl)-methanone
TypeSmall organic molecule
Emp. Form.C27H35BrN2O
Mol. Mass.483.484
SMILESCc1cccc(C)c1C(=O)N1CCC(C)(CC1)N1CCC(Cc2ccc(Br)cc2)CC1