Reaction Details
TargetcGMP-dependent 3',5'-cyclic phosphodiesterase
LigandBDBM50134099
Substrate/Competitorn/a
Meas. Tech.ChEMBL_156317 (CHEMBL762550)
IC50>10000±n/a nM
Citation Daugan, AGrondin, PRuault, CLe Monnier de Gouville, ACCoste, HKirilovsky, JHyafil, FLabaudinière, R The discovery of tadalafil: a novel and highly selective PDE5 inhibitor. 1: 5,6,11,11a-tetrahydro-1H-imidazo[1',5':1,6]pyrido[3,4-b]indole-1,3(2H)-dione analogues. J Med Chem46:4525-32 (2003) 
 
cGMP-dependent 3',5'-cyclic phosphodiesterase
Name:cGMP-dependent 3',5'-cyclic phosphodiesterase
Type:Enzyme Catalytic Domain
Mol. Mass.:105691.58
Organism:Homo sapiens (Human)
Description:O00408
Residue:941
BDBM50134099
NameBDBM50134099
Synonyms:(3aR,10S)-2-Butyl-10-(4-methoxy-phenyl)-3a,4,9,10-tetrahydro-2,9,10a-triaza-cyclopenta[b]fluorene-1,3-dione Trans-2-Butyl-10-(4-methoxy-phenyl)-3a,4,9,10-tetrahydro-2,9,10a-triaza-cyclopenta[b]fluorene-1,3-dione
TypeSmall organic molecule
Emp. Form.C24H25N3O3
Mol. Mass.403.4736
SMILESCCCCn1c(O)c2Cc3c([nH]c4ccccc34)[C@H](c3ccc(OC)cc3)n2c1=O