Reaction Details
TargetPhosphodiesterase
LigandBDBM50134099
Substrate/Competitorn/a
Meas. Tech.ChEMBL_156452 (CHEMBL764830)
IC50>10000±n/a nM
Citation Daugan, AGrondin, PRuault, CLe Monnier de Gouville, ACCoste, HKirilovsky, JHyafil, FLabaudinière, R The discovery of tadalafil: a novel and highly selective PDE5 inhibitor. 1: 5,6,11,11a-tetrahydro-1H-imidazo[1',5':1,6]pyrido[3,4-b]indole-1,3(2H)-dione analogues. J Med Chem46:4525-32 (2003) 
 
Phosphodiesterase
Name:Phosphodiesterase
Type:PROTEIN
Mol. Mass.:124301.20
Organism:Bos taurus
Description:ChEMBL_156453
Residue:1115
BDBM50134099
NameBDBM50134099
Synonyms:(3aR,10S)-2-Butyl-10-(4-methoxy-phenyl)-3a,4,9,10-tetrahydro-2,9,10a-triaza-cyclopenta[b]fluorene-1,3-dione Trans-2-Butyl-10-(4-methoxy-phenyl)-3a,4,9,10-tetrahydro-2,9,10a-triaza-cyclopenta[b]fluorene-1,3-dione
TypeSmall organic molecule
Emp. Form.C24H25N3O3
Mol. Mass.403.4736
SMILESCCCCn1c(O)c2Cc3c([nH]c4ccccc34)[C@H](c3ccc(OC)cc3)n2c1=O