Reaction Details
TargetcGMP-specific 3',5'-cyclic phosphodiesterase
LigandBDBM50134105
Substrate/Competitorn/a
Meas. Tech.ChEMBL_155183 (CHEMBL761830)
IC50 10±n/a nM
Citation Daugan, AGrondin, PRuault, CLe Monnier de Gouville, ACCoste, HKirilovsky, JHyafil, FLabaudinière, R The discovery of tadalafil: a novel and highly selective PDE5 inhibitor. 1: 5,6,11,11a-tetrahydro-1H-imidazo[1',5':1,6]pyrido[3,4-b]indole-1,3(2H)-dione analogues. J Med Chem46:4525-32 (2003) 
 
cGMP-specific 3',5'-cyclic phosphodiesterase
Name:cGMP-specific 3',5'-cyclic phosphodiesterase
Type:PROTEIN
Mol. Mass.:98615.45
Organism:Bos taurus
Description:ChEMBL_155186
Residue:865
BDBM50134105
NameBDBM50134105
Synonyms:(3aR,10R)-10-(4-Methoxy-phenyl)-2-methyl-3a,4,9,10-tetrahydro-2,9,10a-triaza-cyclopenta[b]fluorene-1,3-dione | CHEMBL344173
TypeSmall organic molecule
Emp. Form.C21H19N3O3
Mol. Mass.361.3939
SMILESCOc1ccc(cc1)[C@@H]1c2[nH]c3ccccc3c2Cc2c(O)n(C)c(=O)n12