Reaction Details
TargetcGMP-specific 3',5'-cyclic phosphodiesterase
LigandBDBM50134121
Substrate/Competitorn/a
Meas. Tech.ChEMBL_155183 (CHEMBL761830)
IC50 90±n/a nM
Citation Daugan, AGrondin, PRuault, CLe Monnier de Gouville, ACCoste, HKirilovsky, JHyafil, FLabaudinière, R The discovery of tadalafil: a novel and highly selective PDE5 inhibitor. 1: 5,6,11,11a-tetrahydro-1H-imidazo[1',5':1,6]pyrido[3,4-b]indole-1,3(2H)-dione analogues. J Med Chem46:4525-32 (2003) 
 
cGMP-specific 3',5'-cyclic phosphodiesterase
Name:cGMP-specific 3',5'-cyclic phosphodiesterase
Type:PROTEIN
Mol. Mass.:98615.45
Organism:Bos taurus
Description:ChEMBL_155186
Residue:865
BDBM50134121
NameBDBM50134121
Synonyms:(3aR,10R)-2-Butyl-10-pyridin-3-yl-3a,4,9,10-tetrahydro-2,9,10a-triaza-cyclopenta[b]fluorene-1,3-dione Cis-2-Butyl-10-pyridin-3-yl-3a,4,9,10-tetrahydro-2,9,10a-triaza-cyclopenta[b]fluorene-1,3-dione
TypeSmall organic molecule
Emp. Form.C22H22N4O2
Mol. Mass.374.4357
SMILESCCCCn1c(O)c2Cc3c([nH]c4ccccc34)[C@@H](c3cccnc3)n2c1=O