Reaction Details
TargetNuclear receptor subfamily 1 group I member 3
LigandBDBM50422490
Substrate/Competitorn/a
Meas. Tech.ChEMBL_48051 (CHEMBL875886)
IC50 794±n/a nM
Citation Jyrkkärinne, JMäkinen, JGynther, JSavolainen, HPoso, AHonkakoski, P Molecular determinants of steroid inhibition for the mouse constitutive androstane receptor. J Med Chem46:4687-95 (2003) 
 
Nuclear receptor subfamily 1 group I member 3
Name:Nuclear receptor subfamily 1 group I member 3
Type:PROTEIN
Mol. Mass.:40922.30
Organism:Mus musculus
Description:ChEMBL_48051
Residue:358
BDBM50422490
NameBDBM50422490
Synonyms:CHEMBL141998
TypeSmall organic molecule
Emp. Form.C19H26O
Mol. Mass.270.4091
SMILESCC12CCC3C(CCC4=CC(=O)CCC34C)C1CC=C2