Reaction Details
TargetHistone deacetylase 4
LigandBDBM50134803
Substrate/Competitorn/a
Meas. Tech.ChEMBL_87890 (CHEMBL698808)
IC50 0.3±n/a nM
Citation Mai, AMassa, SPezzi, RRotili, DLoidl, PBrosch, G Discovery of (aryloxopropenyl)pyrrolyl hydroxyamides as selective inhibitors of class IIa histone deacetylase homologue HD1-A. J Med Chem46:4826-9 (2003) 
 
Histone deacetylase 4
Name:Histone deacetylase 4
Type:Enzyme
Mol. Mass.:119049.39
Organism:Homo sapiens (Human)
Description:P56524
Residue:1084
BDBM50134803
NameBDBM50134803
Synonyms:5,8-Dimethyl-11-(6-oxiranyl-6-oxo-hexyl)-decahydro-3a,6,9,12-tetraaza-cyclopentacyclododecene-4,7,10,13-tetraone | CHEMBL144205
TypeSmall organic molecule
Emp. Form.C21H32N4O6
Mol. Mass.436.502
SMILESC[C@@H]1NC(=O)[C@H](CCCCCC(=O)C2CO2)NC(=O)[C@H]2CCCN2C(=O)[C@H](C)NC1=O