Reaction Details
TargetHistone deacetylase 6
LigandBDBM50134805
Substrate/Competitorn/a
Meas. Tech.ChEMBL_88026 (CHEMBL695890)
EC50 524000±n/a nM
Citation Mai, AMassa, SPezzi, RRotili, DLoidl, PBrosch, G Discovery of (aryloxopropenyl)pyrrolyl hydroxyamides as selective inhibitors of class IIa histone deacetylase homologue HD1-A. J Med Chem46:4826-9 (2003) 
 
Histone deacetylase 6
Name:Histone deacetylase 6
Type:Chromatin regulator; hydrolase; repressor
Mol. Mass.:131381.51
Organism:Homo sapiens (Human)
Description:Q9UBN7
Residue:1215
BDBM50134805
NameBDBM50134805
Synonyms:6,9-Dibenzyl-12-(6-oxiranyl-6-oxo-hexyl)-decahydro-4a,7,10,13-tetraaza-benzocyclododecene-5,8,11,14-tetraone | CHEMBL274445
TypeSmall organic molecule
Emp. Form.C34H42N4O6
Mol. Mass.602.7205
SMILESO=C(CCCCC[C@@H]1NC(=O)[C@H]2CCCCN2C(=O)[C@H](Cc2ccccc2)NC(=O)[C@H](Cc2ccccc2)NC1=O)C1CO1