Reaction Details
TargetAdenosine receptor A2a
LigandBDBM50106535
Substrate/Competitorn/a
Meas. Tech.ChEMBL_31361 (CHEMBL644653)
Ki 57±n/a nM
Citation Kim, SKGao, ZGVan Rompaey, PGross, ASChen, AVan Calenbergh, SJacobson, KA Modeling the adenosine receptors: comparison of the binding domains of A2A agonists and antagonists. J Med Chem46:4847-59 (2003) 
 
Adenosine receptor A2a
Name:Adenosine receptor A2a
Type:G Protein-Coupled Receptor (GPCR)
Mol. Mass.:44716.46
Organism:Homo sapiens (Human)
Description:P29274
Residue:412
BDBM50106535
NameBDBM50106535
Synonyms:(2R,3R,4S,5S)-4-Amino-5-hydroxymethyl-2-[6-(3-iodo-benzylamino)-purin-9-yl]-tetrahydro-furan-3-ol CHEMBL132629
TypeSmall organic molecule
Emp. Form.C17H19IN6O3
Mol. Mass.482.2756
SMILESN[C@@H]1[C@@H](CO)O[C@H]([C@@H]1O)n1cnc2c(NCc3cccc(I)c3)ncnc12