Reaction Details
TargetAdenosine receptor A2a
LigandBDBM50106539
Substrate/Competitorn/a
Meas. Tech.ChEMBL_31358 (CHEMBL644650)
Ki 41±n/a nM
Citation Kim, SKGao, ZGVan Rompaey, PGross, ASChen, AVan Calenbergh, SJacobson, KA Modeling the adenosine receptors: comparison of the binding domains of A2A agonists and antagonists. J Med Chem46:4847-59 (2003) 
 
Adenosine receptor A2a
Name:Adenosine receptor A2a
Type:G Protein-Coupled Receptor (GPCR)
Mol. Mass.:44716.46
Organism:Homo sapiens (Human)
Description:P29274
Residue:412
BDBM50106539
NameBDBM50106539
Synonyms:(2S,3S,4R,5R)-5-(6-Amino-purin-9-yl)-3,4-dihydroxy-tetrahydro-furan-2-carboxylic acid (2-amino-ethyl)-amide 5'-N-[(2-AMINO)ETHYL CARBOXAMIDO] ADENOSINE Adenosine analog, 1 | CHEMBL129903
TypeSmall organic molecule
Emp. Form.C12H17N7O4
Mol. Mass.323.3079
SMILESNCCNC(=O)[C@H]1O[C@H]([C@H](O)[C@@H]1O)n1cnc2c(N)ncnc12