Reaction Details
TargetAdenosine receptor A2a
LigandBDBM50134814
Substrate/Competitorn/a
Meas. Tech.ChEMBL_31353 (CHEMBL641574)
Ki 56±n/a nM
Citation Kim, SKGao, ZGVan Rompaey, PGross, ASChen, AVan Calenbergh, SJacobson, KA Modeling the adenosine receptors: comparison of the binding domains of A2A agonists and antagonists. J Med Chem46:4847-59 (2003) 
 
Adenosine receptor A2a
Name:Adenosine receptor A2a
Type:G Protein-Coupled Receptor (GPCR)
Mol. Mass.:44716.46
Organism:Homo sapiens (Human)
Description:P29274
Residue:412
BDBM50134814
NameBDBM50134814
Synonyms:(2R,3R,4S,5S)-2-(6-(3-iodobenzylamino)-9H-purin-9-yl)-4-(aminomethyl)-5-(hydroxymethyl)-tetrahydrofuran-3-ol CHEMBL144521
TypeSmall organic molecule
Emp. Form.C18H21IN6O3
Mol. Mass.496.3022
SMILESNC[C@@H]1[C@@H](CO)O[C@H]([C@@H]1O)n1cnc2c(NCc3cccc(I)c3)ncnc12