Reaction Details
TargetDelta-type opioid receptor
LigandBDBM50135812
Substrate/Competitorn/a
Meas. Tech.ChEMBL_145615 (CHEMBL754334)
Ki 370±n/a nM
Citation Neumeyer, JLZhang, AXiong, WGu, XHHilbert, JEKnapp, BINegus, SSMello, NKBidlack, JM Design and synthesis of novel dimeric morphinan ligands for kappa and micro opioid receptors. J Med Chem46:5162-70 (2003) 
 
Delta-type opioid receptor
Name:Delta-type opioid receptor
Type:G Protein-Coupled Receptor (GPCR)
Mol. Mass.:40382.98
Organism:Homo sapiens (Human)
Description:Competition binding assays were carried out using membrane preparations from transfected HN9.10 cells that constitutively expressed the delta opioid receptor.
Residue:372
BDBM50135812
NameBDBM50135812
Synonyms:17-{6-[4-hydroxy-(9R,10R)-17-azatetracyclo[7.5.3.01,10.02,7]heptadeca-2(7),3,5-trien-17-yl]hexyl}-(1R,9R,10R)-17-azatetracyclo[7.5.3.01,10.02,7]heptadeca-2(7),3,5-trien-4-ol MCL-134
TypeSmall organic molecule
Emp. Form.C38H52N2O2
Mol. Mass.568.8317
SMILESOc1ccc2C[C@@H]3[C@@H]4CCCC[C@]4(CCN3CCCCCCN3CC[C@]45CCCC[C@H]4[C@H]3Cc3ccc(O)cc53)c2c1