Reaction Details
TargetDelta-type opioid receptor
LigandBDBM50135811
Substrate/Competitorn/a
Meas. Tech.ChEMBL_145615 (CHEMBL754334)
Ki 2500±n/a nM
Citation Neumeyer, JLZhang, AXiong, WGu, XHHilbert, JEKnapp, BINegus, SSMello, NKBidlack, JM Design and synthesis of novel dimeric morphinan ligands for kappa and micro opioid receptors. J Med Chem46:5162-70 (2003) 
 
Delta-type opioid receptor
Name:Delta-type opioid receptor
Type:G Protein-Coupled Receptor (GPCR)
Mol. Mass.:40382.98
Organism:Homo sapiens (Human)
Description:Competition binding assays were carried out using membrane preparations from transfected HN9.10 cells that constitutively expressed the delta opioid receptor.
Residue:372
BDBM50135811
NameBDBM50135811
Synonyms:(1R,9R,10R)-17-(cyclobutylmethyl)-4-[(10-{[(1R,9R,10R)-17-(cyclobutylmethyl)-17-azatetracyclo[7.5.3.0^{1,10}.0^{2,7}]heptadeca-2(7),3,5-trien-4-yl]oxy}decyl)oxy]-17-azatetracyclo[7.5.3.0^{1,10}.0^{2,7}]heptadeca-2(7),3,5-triene CHEMBL151872 | MCL-154
TypeSmall organic molecule
Emp. Form.C52H76N2O2
Mol. Mass.761.172
SMILESC(CCCCCOc1ccc2C[C@@H]3[C@@H]4CCCC[C@]4(CCN3CC3CCC3)c2c1)CCCCOc1ccc2C[C@@H]3[C@@H]4CCCC[C@]4(CCN3CC3CCC3)c2c1