Reaction Details
TargetSodium-dependent serotonin transporter
LigandBDBM22417
Substrate/Competitorn/a
Meas. Tech.ChEMBL_201509 (CHEMBL805636)
IC50>500±n/a nM
Citation Orjales, AMosquera, RToledo, APumar, MCGarcía, NCortizo, LLabeaga, LInnerárity, A Syntheses and binding studies of new [(aryl)(aryloxy)methyl]piperidine derivatives and related compounds as potential antidepressant drugs with high affinity for serotonin (5-HT) and norepinephrine (NE) transporters. J Med Chem46:5512-32 (2003) 
 
Sodium-dependent serotonin transporter
Name:Sodium-dependent serotonin transporter
Type:Multi-pass membrane protein
Mol. Mass.:70168.43
Organism:Rattus norvegicus (rat)
Description:P31652
Residue:630
BDBM22417
NameBDBM22417
Synonyms:3-(2-methoxyphenoxy)-N-methyl-3-phenylpropan-1-amine LY 135252 LY135252 Nisoxetine US9944618, Compound ID No. 177 [3H]Nisoxetine
Typeradiolabeled ligand
Emp. Form.C17H21NO2
Mol. Mass.271.3541
SMILESCNCCC(Oc1ccccc1OC)c1ccccc1