Reaction Details
TargetSomatostatin receptor type 4
LigandBDBM50136784
Substrate/Competitorn/a
Meas. Tech.ChEMBL_200835 (CHEMBL873241)
IC50 1.2±n/a nM
Citation Erchegyi, JPenke, BSimon, LMichaelson, SWenger, SWaser, BCescato, RSchaer, JCReubi, JCRivier, J Novel sst(4)-selective somatostatin (SRIF) agonists. 2. Analogues with beta-methyl-3-(2-naphthyl)alanine substitutions at position 8. J Med Chem46:5587-96 (2003) 
 
Somatostatin receptor type 4
Name:Somatostatin receptor type 4
Type:Enzyme
Mol. Mass.:42015.38
Organism:Homo sapiens (Human)
Description:P31391
Residue:388
BDBM50136784
NameBDBM50136784
Synonyms:6-amino-18-(4-aminobutyl)-9,24-dibenzyl-12-(4-hydroxybenzyl)-21-(1-hydroxyethyl)-15-(1-naphthylmethyl)-7,10,13,16,19,22,25-heptaoxo-3,4-dithia-8,11,14,17,20,23,26-heptaazacyclohexacosane-1-carboxylic acid | CHEMBL414916
TypeSmall organic molecule
Emp. Form.C56H67N9O11S2
Mol. Mass.1106.315
SMILESC[C@@H](O)[C@@H]1NC(=O)[C@H](CCCCN)NC(=O)C(Cc2cccc3ccccc23)NC(=O)[C@H](Cc2ccc(O)cc2)NC(=O)[C@@H](Cc2ccccc2)NC(=O)[C@@H](N)CSSC[C@@H](NC(=O)[C@H](Cc2ccccc2)NC1=O)C(O)=O