Reaction Details
TargetSomatostatin receptor type 4
LigandBDBM50136774
Substrate/Competitorn/a
Meas. Tech.ChEMBL_200835 (CHEMBL873241)
IC50 0.53±n/a nM
Citation Erchegyi, JPenke, BSimon, LMichaelson, SWenger, SWaser, BCescato, RSchaer, JCReubi, JCRivier, J Novel sst(4)-selective somatostatin (SRIF) agonists. 2. Analogues with beta-methyl-3-(2-naphthyl)alanine substitutions at position 8. J Med Chem46:5587-96 (2003) 
 
Somatostatin receptor type 4
Name:Somatostatin receptor type 4
Type:Enzyme
Mol. Mass.:42015.38
Organism:Homo sapiens (Human)
Description:P31391
Residue:388
BDBM50136774
NameBDBM50136774
Synonyms:6-amino-18-(4-aminobutyl)-9,24-dibenzyl-12-(4-hydroxybenzyl)-21-(1-hydroxyethyl)-15-[1-(2-naphthyl)ethyl]-7,10,13,16,19,22,25-heptaoxo-3,4-dithia-8,11,14,17,20,23,26-heptaazacyclohexacosane-1-carboxylic acid | CHEMBL415582
TypeSmall organic molecule
Emp. Form.C57H69N9O11S2
Mol. Mass.1120.341
SMILESC[C@@H](O)[C@H]1NC(=O)[C@H](CCCCN)NC(=O)[C@H](NC(=O)[C@H](Cc2ccc(O)cc2)NC(=O)[C@@H](Cc2ccccc2)NC(=O)[C@H](N)CSSC[C@H](NC(=O)[C@H](Cc2ccccc2)NC1=O)C(O)=O)[C@@H](C)c1ccc2ccccc2c1