Reaction Details
TargetMitogen-activated protein kinase 14
LigandBDBM50136897
Substrate/Competitorn/a
Meas. Tech.ChEMBL_124178 (CHEMBL732094)
IC50 7±n/a nM
Citation Ottosen, ERSørensen, MDBjörkling, FSkak-Nielsen, TFjording, MSAaes, HBinderup, L Synthesis and structure-activity relationship of aminobenzophenones. A novel class of p38 MAP kinase inhibitors with high antiinflammatory activity. J Med Chem46:5651-62 (2003) 
 
Mitogen-activated protein kinase 14
Name:Mitogen-activated protein kinase 14
Type:Serine/threonine-protein kinase
Mol. Mass.:41286.76
Organism:Homo sapiens (Human)
Description:Q16539
Residue:360
BDBM50136897
NameBDBM50136897
Synonyms:(2-Chloro-4-phenylamino-phenyl)-o-tolyl-methanone CHEMBL155567
TypeSmall organic molecule
Emp. Form.C20H16ClNO
Mol. Mass.321.8
SMILESCc1ccccc1C(=O)c1ccc(Nc2ccccc2)cc1Cl