Reaction Details
TargetMitogen-activated protein kinase 14
LigandBDBM50136892
Substrate/Competitorn/a
Meas. Tech.ChEMBL_124178 (CHEMBL732094)
IC50 811±n/a nM
Citation Ottosen, ERSørensen, MDBjörkling, FSkak-Nielsen, TFjording, MSAaes, HBinderup, L Synthesis and structure-activity relationship of aminobenzophenones. A novel class of p38 MAP kinase inhibitors with high antiinflammatory activity. J Med Chem46:5651-62 (2003) 
 
Mitogen-activated protein kinase 14
Name:Mitogen-activated protein kinase 14
Type:Serine/threonine-protein kinase
Mol. Mass.:41286.76
Organism:Homo sapiens (Human)
Description:Q16539
Residue:360
BDBM50136892
NameBDBM50136892
Synonyms:CHEMBL356809 | [4-(2-Amino-phenylamino)-phenyl]-biphenyl-2-yl-methanone
TypeSmall organic molecule
Emp. Form.C25H20N2O
Mol. Mass.364.4391
SMILESNc1ccccc1Nc1ccc(cc1)C(=O)c1ccccc1-c1ccccc1