Reaction Details
TargetSolute carrier family 15 member 1
LigandBDBM50136961
Substrate/Competitorn/a
Meas. Tech.ChEMBL_89213 (CHEMBL699705)
Ki 980000±n/a nM
Citation Gebauer, SKnütter, IHartrodt, BBrandsch, MNeubert, KThondorf, I Three-dimensional quantitative structure-activity relationship analyses of peptide substrates of the mammalian H+/peptide cotransporter PEPT1. J Med Chem46:5725-34 (2003) 
 
Solute carrier family 15 member 1
Name:Solute carrier family 15 member 1
Type:PROTEIN
Mol. Mass.:78818.07
Organism:Homo sapiens (Human)
Description:ChEMBL_1488839
Residue:708
BDBM50136961
NameBDBM50136961
Synonyms:5-ammonio-2-[(2-ammoniopropanoyl)amino]pentanoate
TypeSmall organic molecule
Emp. Form.C8H18N3O3
Mol. Mass.204.2463
SMILESCC([NH3+])C(=O)NC(CCC[NH3+])C([O-])=O