Reaction Details
TargetSolute carrier family 15 member 1
LigandBDBM50137004
Substrate/Competitorn/a
Meas. Tech.ChEMBL_89213 (CHEMBL699705)
Ki 140000±n/a nM
Citation Gebauer, SKnütter, IHartrodt, BBrandsch, MNeubert, KThondorf, I Three-dimensional quantitative structure-activity relationship analyses of peptide substrates of the mammalian H+/peptide cotransporter PEPT1. J Med Chem46:5725-34 (2003) 
 
Solute carrier family 15 member 1
Name:Solute carrier family 15 member 1
Type:PROTEIN
Mol. Mass.:78818.07
Organism:Homo sapiens (Human)
Description:ChEMBL_1488839
Residue:708
BDBM50137004
NameBDBM50137004
Synonyms:2-[(2-ammoniohexanoyl)amino]propanoate | CHEMBL153844
TypeSmall organic molecule
Emp. Form.C9H18N2O3
Mol. Mass.202.2508
SMILESCCCCC([NH3+])C(=O)NC(C)C([O-])=O