Reaction Details
TargetSolute carrier family 15 member 1
LigandBDBM50136999
Substrate/Competitorn/a
Meas. Tech.ChEMBL_89213 (CHEMBL699705)
Ki 8300000±n/a nM
Citation Gebauer, SKnütter, IHartrodt, BBrandsch, MNeubert, KThondorf, I Three-dimensional quantitative structure-activity relationship analyses of peptide substrates of the mammalian H+/peptide cotransporter PEPT1. J Med Chem46:5725-34 (2003) 
 
Solute carrier family 15 member 1
Name:Solute carrier family 15 member 1
Type:PROTEIN
Mol. Mass.:78818.07
Organism:Homo sapiens (Human)
Description:ChEMBL_1488839
Residue:708
BDBM50136999
NameBDBM50136999
Synonyms:3-ammonio-3-(1-benzyloxycarbonylethylcarbamoyl)propanoate CHEMBL44644
TypeSmall organic molecule
Emp. Form.C14H18N2O5
Mol. Mass.294.3031
SMILESCC(NC(=O)C([NH3+])CC([O-])=O)C(=O)OCc1ccccc1