Reaction Details
TargetSolute carrier family 15 member 1
LigandBDBM50137019
Substrate/Competitorn/a
Meas. Tech.ChEMBL_89213 (CHEMBL699705)
Ki 480000±n/a nM
Citation Gebauer, SKnütter, IHartrodt, BBrandsch, MNeubert, KThondorf, I Three-dimensional quantitative structure-activity relationship analyses of peptide substrates of the mammalian H+/peptide cotransporter PEPT1. J Med Chem46:5725-34 (2003) 
 
Solute carrier family 15 member 1
Name:Solute carrier family 15 member 1
Type:PROTEIN
Mol. Mass.:78818.07
Organism:Homo sapiens (Human)
Description:ChEMBL_1488839
Residue:708
BDBM50137019
NameBDBM50137019
Synonyms:2-{[2-ammonio-3-(1H-imidazol-5-yl)propanoyl]amino}propanoate | CHEMBL153931
TypeSmall organic molecule
Emp. Form.C9H14N4O3
Mol. Mass.226.2325
SMILESCC(NC(=O)C([NH3+])Cc1cnc[nH]1)C([O-])=O