Reaction Details
TargetSolute carrier family 15 member 1
LigandBDBM50137026
Substrate/Competitorn/a
Meas. Tech.ChEMBL_89213 (CHEMBL699705)
Ki 140000±n/a nM
Citation Gebauer, SKnütter, IHartrodt, BBrandsch, MNeubert, KThondorf, I Three-dimensional quantitative structure-activity relationship analyses of peptide substrates of the mammalian H+/peptide cotransporter PEPT1. J Med Chem46:5725-34 (2003) 
 
Solute carrier family 15 member 1
Name:Solute carrier family 15 member 1
Type:PROTEIN
Mol. Mass.:78818.07
Organism:Homo sapiens (Human)
Description:ChEMBL_1488839
Residue:708
BDBM50137026
NameBDBM50137026
Synonyms:1-(2-ammonio-5-oxido-5-oxopentanoyl)pyrrolidine-2-carboxylate
TypeSmall organic molecule
Emp. Form.C10H15N2O5
Mol. Mass.243.237
SMILES[NH3+]C(CCC([O-])=O)C(=O)N1CCCC1C([O-])=O