Reaction Details
TargetSolute carrier family 15 member 1
LigandBDBM50137038
Substrate/Competitorn/a
Meas. Tech.ChEMBL_89213 (CHEMBL699705)
Ki 320000±n/a nM
Citation Gebauer, SKnütter, IHartrodt, BBrandsch, MNeubert, KThondorf, I Three-dimensional quantitative structure-activity relationship analyses of peptide substrates of the mammalian H+/peptide cotransporter PEPT1. J Med Chem46:5725-34 (2003) 
 
Solute carrier family 15 member 1
Name:Solute carrier family 15 member 1
Type:PROTEIN
Mol. Mass.:78818.07
Organism:Homo sapiens (Human)
Description:ChEMBL_1488839
Residue:708
BDBM50137038
NameBDBM50137038
Synonyms:3-ammonio-4-[(1-methyl-2-oxido-2-oxoethyl)amino]-4-oxobutanoate
TypeSmall organic molecule
Emp. Form.C7H11N2O5
Mol. Mass.203.1732
SMILESCC(NC(=O)C([NH3+])CC([O-])=O)C([O-])=O