Reaction Details
TargetSolute carrier family 15 member 1
LigandBDBM50169222
Substrate/Competitorn/a
Meas. Tech.ChEMBL_89213 (CHEMBL699705)
Ki 1000000±n/a nM
Citation Gebauer, SKnütter, IHartrodt, BBrandsch, MNeubert, KThondorf, I Three-dimensional quantitative structure-activity relationship analyses of peptide substrates of the mammalian H+/peptide cotransporter PEPT1. J Med Chem46:5725-34 (2003) 
 
Solute carrier family 15 member 1
Name:Solute carrier family 15 member 1
Type:PROTEIN
Mol. Mass.:78818.07
Organism:Homo sapiens (Human)
Description:ChEMBL_1488839
Residue:708
BDBM50169222
NameBDBM50169222
Synonyms:2-(aminoacetamido)acetic acid Gly-Gly N-glycylglycine glycine dipeptide | glycylglycine
TypeSmall organic molecule
Emp. Form.C4H8N2O3
Mol. Mass.132.1179
SMILESNCC(=O)NCC(O)=O