Reaction Details
TargetSolute carrier family 15 member 1
LigandBDBM50137032
Substrate/Competitorn/a
Meas. Tech.ChEMBL_89213 (CHEMBL699705)
Ki 460000±n/a nM
Citation Gebauer, SKnütter, IHartrodt, BBrandsch, MNeubert, KThondorf, I Three-dimensional quantitative structure-activity relationship analyses of peptide substrates of the mammalian H+/peptide cotransporter PEPT1. J Med Chem46:5725-34 (2003) 
 
Solute carrier family 15 member 1
Name:Solute carrier family 15 member 1
Type:PROTEIN
Mol. Mass.:78818.07
Organism:Homo sapiens (Human)
Description:ChEMBL_1488839
Residue:708
BDBM50137032
NameBDBM50137032
Synonyms:1-[(3-chlorophenyl)amino]-1-oxopropan-2-aminium
TypeSmall organic molecule
Emp. Form.C9H12ClN2O
Mol. Mass.199.657
SMILESCC([NH3+])C(=O)Nc1cccc(Cl)c1