Reaction Details
TargetSolute carrier family 15 member 1
LigandBDBM50137047
Substrate/Competitorn/a
Meas. Tech.ChEMBL_89213 (CHEMBL699705)
Ki 310000±n/a nM
Citation Gebauer, SKnütter, IHartrodt, BBrandsch, MNeubert, KThondorf, I Three-dimensional quantitative structure-activity relationship analyses of peptide substrates of the mammalian H+/peptide cotransporter PEPT1. J Med Chem46:5725-34 (2003) 
 
Solute carrier family 15 member 1
Name:Solute carrier family 15 member 1
Type:PROTEIN
Mol. Mass.:78818.07
Organism:Homo sapiens (Human)
Description:ChEMBL_1488839
Residue:708
BDBM50137047
NameBDBM50137047
Synonyms:3-[(2-ammoniopropanoyl)amino]benzoate | CHEMBL152123
TypeSmall organic molecule
Emp. Form.C10H12N2O3
Mol. Mass.208.2139
SMILESCC([NH3+])C(=O)Nc1cccc(c1)C([O-])=O