Reaction Details
TargetMu-type opioid receptor
LigandBDBM50123656
Substrate/Competitorn/a
Meas. Tech.ChEMBL_148853 (CHEMBL756649)
Ki 2.35±n/a nM
Citation Bishop, MJGarrido, DMBoswell, GECollins, MAHarris, PAMcNutt, RWO'Neill, SJWei, KChang, KJ 3-(alphaR)-alpha-((2S,5R)-4-allyl-2,5-dimethyl-1-piperazinyl)-3-hydroxybenzyl)-N-alkyl-N-arylbenzamides: potent, non-peptidic agonists of both the micro and delta opioid receptors. J Med Chem46:623-33 (2003) 
 
Mu-type opioid receptor
Name:Mu-type opioid receptor
Type:G Protein-Coupled Receptor (GPCR)
Mol. Mass.:44503.11
Organism:Rattus norvegicus (rat)
Description:Competition binding assays were carried out using membrane preparations from transfected HN9.10 cells that constitutively expressed the mu opioid receptor.
Residue:398
BDBM50123656
NameBDBM50123656
Synonyms:3-[(R)-((2S,5R)-4-Allyl-2,5-dimethyl-piperazin-1-yl)-(3-hydroxy-phenyl)-methyl]-N-(4-methoxy-phenyl)-N-methyl-benzamide | CHEMBL346514
TypeSmall organic molecule
Emp. Form.C31H37N3O3
Mol. Mass.499.6438
SMILESCOc1ccc(cc1)N(C)C(=O)c1cccc(c1)[C@@H](N1C[C@@H](C)N(CC=C)C[C@@H]1C)c1cccc(O)c1