Reaction Details
TargetDelta-type opioid receptor
LigandBDBM50123650
Substrate/Competitorn/a
Meas. Tech.ChEMBL_146914 (CHEMBL757502)
Ki 2.17±n/a nM
Citation Bishop, MJGarrido, DMBoswell, GECollins, MAHarris, PAMcNutt, RWO'Neill, SJWei, KChang, KJ 3-(alphaR)-alpha-((2S,5R)-4-allyl-2,5-dimethyl-1-piperazinyl)-3-hydroxybenzyl)-N-alkyl-N-arylbenzamides: potent, non-peptidic agonists of both the micro and delta opioid receptors. J Med Chem46:623-33 (2003) 
 
Delta-type opioid receptor
Name:Delta-type opioid receptor
Type:G Protein-Coupled Receptor (GPCR)
Mol. Mass.:40465.04
Organism:Rattus norvegicus (rat)
Description:Competition binding assays were using CHO-K1 cell membranes expressing the opioid receptor.
Residue:372
BDBM50123650
NameBDBM50123650
Synonyms:3-[(R)-((2S,5R)-4-Allyl-2,5-dimethyl-piperazin-1-yl)-(3-hydroxy-phenyl)-methyl]-N-ethyl-N-phenyl-benzamide | CHEMBL349120
TypeSmall organic molecule
Emp. Form.C31H37N3O2
Mol. Mass.483.6444
SMILESCCN(C(=O)c1cccc(c1)[C@@H](N1C[C@@H](C)N(CC=C)C[C@@H]1C)c1cccc(O)c1)c1ccccc1