Reaction Details
TargetDelta-type opioid receptor
LigandBDBM50123657
Substrate/Competitorn/a
Meas. Tech.ChEMBL_146914 (CHEMBL757502)
Ki 1.88±n/a nM
Citation Bishop, MJGarrido, DMBoswell, GECollins, MAHarris, PAMcNutt, RWO'Neill, SJWei, KChang, KJ 3-(alphaR)-alpha-((2S,5R)-4-allyl-2,5-dimethyl-1-piperazinyl)-3-hydroxybenzyl)-N-alkyl-N-arylbenzamides: potent, non-peptidic agonists of both the micro and delta opioid receptors. J Med Chem46:623-33 (2003) 
 
Delta-type opioid receptor
Name:Delta-type opioid receptor
Type:G Protein-Coupled Receptor (GPCR)
Mol. Mass.:40465.04
Organism:Rattus norvegicus (rat)
Description:Competition binding assays were using CHO-K1 cell membranes expressing the opioid receptor.
Residue:372
BDBM50123657
NameBDBM50123657
Synonyms:3-[(R)-((2S,5R)-4-Allyl-2,5-dimethyl-piperazin-1-yl)-(3-hydroxy-phenyl)-methyl]-N-benzyl-N-methyl-benzamide | CHEMBL422877
TypeSmall organic molecule
Emp. Form.C31H37N3O2
Mol. Mass.483.6444
SMILESC[C@@H]1CN([C@@H](c2cccc(O)c2)c2cccc(c2)C(=O)N(C)Cc2ccccc2)[C@@H](C)CN1CC=C