Reaction Details
Target5-hydroxytryptamine receptor 3A/3B
LigandBDBM50123813
Substrate/Competitorn/a
Meas. Tech.ChEMBL_3167 (CHEMBL617812)
IC50 0.76±n/a nM
Citation Hirokawa, YFujiwara, ISuzuki, KHarada, HYoshikawa, TYoshida, NKato, S Synthesis and structure-affinity relationships of novel N-(1-ethyl-4-methylhexahydro-1,4-diazepin-6-yl)pyridine-3-carboxamides with potent serotonin 5-HT3 and dopamine D2 receptor antagonistic activity. J Med Chem46:702-15 (2003) 
 
5-hydroxytryptamine receptor 3A/3B
Name:5-hydroxytryptamine receptor 3A/3B
Type:n/a
Mol. Mass.:n/a
Description:ASSAY_ID of EBI is 2974
Components:This complex has 2 components.
Component 1
Name:5-hydroxytryptamine receptor 3B
Synonyms:5HT3B_RAT Serotonin (5-HT) receptor
Type:PROTEIN
Mol. Mass.:50328.78
Organism:Rattus norvegicus
Description:EBI_11885
Residue:437
Component 2
Name:5-hydroxytryptamine receptor 3A
Synonyms:5-HT3 5HT3A_RAT Htr3 Serotonin (5-HT) receptor | Zacopride site-R
Type:Enzyme Catalytic Domain
Mol. Mass.:55428.70
Organism:RAT
Description:5-HT3 HTR3A RAT::P35563
Residue:483
BDBM50123813
NameBDBM50123813
Synonyms:5-Bromo-2-methoxy-6-methylamino-N-(1-methyl-4-propyl-[1,4]diazepan-6-yl)-nicotinamide | CHEMBL351377
TypeSmall organic molecule
Emp. Form.C17H28BrN5O2
Mol. Mass.414.341
SMILESCCCN1CCN(C)CC(C1)NC(=O)c1cc(Br)c(NC)nc1OC