Reaction Details
TargetFatty-acid amide hydrolase 1 [30-579]
LigandBDBM50107607
Substrate/Competitorn/a
Meas. Tech.ChEMBL_68636 (CHEMBL680041)
IC50 30000±n/a nM
Citation López-Rodríguez, MLViso, AOrtega-Gutiérrez, SFowler, CJTiger, Gde Lago, EFernández-Ruiz, JRamos, JA Design, synthesis, and biological evaluation of new inhibitors of the endocannabinoid uptake: comparison with effects on fatty acid amidohydrolase. J Med Chem46:1512-22 (2003) 
 
Fatty-acid amide hydrolase 1 [30-579]
Name:Fatty-acid amide hydrolase 1 [30-579]
Type:Single-pass membrane protein; homodimer
Mol. Mass.:60474.00
Organism:Rattus norvegicus (rat)
Description:P97612 (aa 30-579)
Residue:550
BDBM50107607
NameBDBM50107607
Synonyms:(5Z,8Z)-Icosa-5,8,11,14-tetraenoic acid (furan-3-ylmethyl)-amide CHEMBL434778 | Icosa-5,8,11,14-tetraenoic acid (furan-3-ylmethyl)-amide
TypeSmall organic molecule
Emp. Form.C25H37NO2
Mol. Mass.383.5668
SMILESCCCCC\C=C/C\C=C/C\C=C/C\C=C/CCCC(=O)NCc1ccoc1