Reaction Details
TargetDelta-type opioid receptor
LigandBDBM50027099
Substrate/Competitorn/a
Meas. Tech.ChEMBL_145466 (CHEMBL751253)
Ki 24±n/a nM
Citation Grundt, PJales, ARTraynor, JRLewis, JWHusbands, SM 14-amino, 14-alkylamino, and 14-acylamino analogs of oxymorphindole. Differential effects on opioid receptor binding and functional profiles. J Med Chem46:1563-6 (2003) 
 
Delta-type opioid receptor
Name:Delta-type opioid receptor
Type:G Protein-Coupled Receptor (GPCR)
Mol. Mass.:40382.98
Organism:Homo sapiens (Human)
Description:Competition binding assays were carried out using membrane preparations from transfected HN9.10 cells that constitutively expressed the delta opioid receptor.
Residue:372
BDBM50027099
NameBDBM50027099
Synonyms:CHEMBL2113380
TypeSmall organic molecule
Emp. Form.C32H32N2O2
Mol. Mass.476.6087
SMILES[H][C@@]12Oc3c4c(CC5N(C)CC[C@@]14[C@@]5(CCCc1ccccc1)Cc1c2[nH]c2ccccc12)ccc3O