Reaction Details
TargetMu-type opioid receptor
LigandBDBM50027097
Substrate/Competitorn/a
Meas. Tech.ChEMBL_148088 (CHEMBL754376)
Ki 1.7±n/a nM
Citation Grundt, PJales, ARTraynor, JRLewis, JWHusbands, SM 14-amino, 14-alkylamino, and 14-acylamino analogs of oxymorphindole. Differential effects on opioid receptor binding and functional profiles. J Med Chem46:1563-6 (2003) 
 
Mu-type opioid receptor
Name:Mu-type opioid receptor
Type:G Protein-Coupled Receptor (GPCR)
Mol. Mass.:44789.51
Organism:Homo sapiens (Human)
Description:P35372
Residue:400
BDBM50027097
NameBDBM50027097
Synonyms:CHEMBL2113382
TypeSmall organic molecule
Emp. Form.C31H31N3O2
Mol. Mass.477.5967
SMILES[H][C@@]12Oc3c4c(CC5N(C)CC[C@@]14[C@]5(Cc1c2[nH]c2ccccc12)NCCc1ccccc1)ccc3O