Reaction Details
TargetNitric oxide synthase, brain
LigandBDBM50127046
Substrate/Competitorn/a
Meas. Tech.ChEMBL_143518 (CHEMBL755131)
Ki 1370±n/a nM
Citation Hah, JMMartásek, PRoman, LJSilverman, RB Aromatic reduced amide bond peptidomimetics as selective inhibitors of neuronal nitric oxide synthase. J Med Chem46:1661-9 (2003) 
 
Nitric oxide synthase, brain
Name:Nitric oxide synthase, brain
Type:Enzyme
Mol. Mass.:160570.98
Organism:Rattus norvegicus (rat)
Description:Recombinant nNOS overexpressed in E. coli was used in enzyme assays.
Residue:1429
BDBM50127046
NameBDBM50127046
Synonyms:CHEMBL46913 | N-((4S)-4-amino-5-{[4-(aminomethyl)phenyl]amino}pentyl)-N'-nitroguanidine
TypeSmall organic molecule
Emp. Form.C13H23N7O2
Mol. Mass.309.3674
SMILESNCc1ccc(NC[C@@H](N)CCCNC(=N)N[N+]([O-])=O)cc1